Target
Glycogen phosphorylase, liver form
Ligand
BDBM50256330
Substrate
Meas. Tech.
ChEMBL_515050 (CHEMBL1034792)
IC50
14±n/a nM
Citation
 Sparks, SMBanker, PBickett, DMCarter, HLClancy, DCDickerson, SHDwornik, KAGarrido, DMGolden, PLNolte, RTPeat, AJSheckler, LRTavares, FXThomson, SAWang, LWeiel, JE Anthranilimide-based glycogen phosphorylase inhibitors for the treatment of type 2 diabetes: 1. Identification of 1-amino-1-cycloalkyl carboxylic acid headgroups. Bioorg Med Chem Lett 19:976-80 (2009)  
Target
Name:
Glycogen phosphorylase, liver form
Synonyms:
Glycogen Phosphorylase (PYGL) Liver glycogen phosphorylase PYGL_HUMAN
Type:
Homodimer
Mol. Mass.:
97153.98
Organism:
Homo sapiens (Human)
Description:
Dimers associate into a tetramer to form the enzymatically active phosphorylase A.
Residue:
847
  
Inhibitor
Name:
BDBM50256330
Synonyms:
1-(3-(3-mesitylureido)-2-naphthamido)cyclodecanecarboxylic acid | CHEMBL481535
Type:
Small organic molecule
Emp. Form.:
C32H39N3O4
Mol. Mass.:
529.6698
SMILES:
Cc1cc(C)c(NC(=O)Nc2cc3ccccc3cc2C(=O)NC2(CCCCCCCCC2)C(O)=O)c(C)c1
: