Target
Glycogen phosphorylase, liver form
Ligand
BDBM50256073
Substrate
Meas. Tech.
ChEMBL_515052 (CHEMBL1034794)
IC50
2400±n/a nM
Citation
 Sparks, SMBanker, PBickett, DMCarter, HLClancy, DCDickerson, SHDwornik, KAGarrido, DMGolden, PLNolte, RTPeat, AJSheckler, LRTavares, FXThomson, SAWang, LWeiel, JE Anthranilimide-based glycogen phosphorylase inhibitors for the treatment of type 2 diabetes: 1. Identification of 1-amino-1-cycloalkyl carboxylic acid headgroups. Bioorg Med Chem Lett 19:976-80 (2009)  
Target
Name:
Glycogen phosphorylase, liver form
Synonyms:
Glycogen Phosphorylase (PYGL) Liver glycogen phosphorylase PYGL_HUMAN
Type:
Homodimer
Mol. Mass.:
97153.98
Organism:
Homo sapiens (Human)
Description:
Dimers associate into a tetramer to form the enzymatically active phosphorylase A.
Residue:
847
  
Inhibitor
Name:
BDBM50256073
Synonyms:
(S)-2-((1s,4R)-4-tert-butylcyclohexyl)-2-(3-(3-(2,4,6-trichlorophenyl)ureido)-2-naphthamido)acetic acid | CHEMBL480733
Type:
Small organic molecule
Emp. Form.:
C30H32Cl3N3O4
Mol. Mass.:
604.952
SMILES:
CC(C)(C)[C@@H]1CC[C@@H](CC1)[C@H](NC(=O)c1cc2ccccc2cc1NC(=O)Nc1c(Cl)cc(Cl)cc1Cl)C(O)=O
: