Target
Glycogen phosphorylase, liver form
Ligand
BDBM50256667
Substrate
Meas. Tech.
ChEMBL_515066 (CHEMBL1034808)
IC50
156±n/a nM
Citation
 Sparks, SMBanker, PBickett, DMClancy, DCDickerson, SHGarrido, DMGolden, PLPeat, AJSheckler, LRTavares, FXThomson, SAWeiel, JE Anthranilimide-based glycogen phosphorylase inhibitors for the treatment of Type 2 diabetes: 2. Optimization of serine and threonine ether amino acid residues. Bioorg Med Chem Lett 19:981-5 (2009)  
Target
Name:
Glycogen phosphorylase, liver form
Synonyms:
Glycogen Phosphorylase (PYGL) Liver glycogen phosphorylase PYGL_HUMAN
Type:
Homodimer
Mol. Mass.:
97153.98
Organism:
Homo sapiens (Human)
Description:
Dimers associate into a tetramer to form the enzymatically active phosphorylase A.
Residue:
847
  
Inhibitor
Name:
BDBM50256667
Synonyms:
(2S,3R)-3-isopropoxy-2-(3-(3-mesitylureido)-2-naphthamido)butanoic acid | CHEMBL473850
Type:
Small organic molecule
Emp. Form.:
C28H33N3O5
Mol. Mass.:
491.5787
SMILES:
CC(C)O[C@H](C)[C@H](NC(=O)c1cc2ccccc2cc1NC(=O)Nc1c(C)cc(C)cc1C)C(O)=O
: