Target
Glycogen phosphorylase, liver form
Ligand
BDBM50256711
Substrate
Meas. Tech.
ChEMBL_515065 (CHEMBL1034807)
IC50
24±n/a nM
Citation
 Sparks, SMBanker, PBickett, DMClancy, DCDickerson, SHGarrido, DMGolden, PLPeat, AJSheckler, LRTavares, FXThomson, SAWeiel, JE Anthranilimide-based glycogen phosphorylase inhibitors for the treatment of Type 2 diabetes: 2. Optimization of serine and threonine ether amino acid residues. Bioorg Med Chem Lett 19:981-5 (2009)  
Target
Name:
Glycogen phosphorylase, liver form
Synonyms:
Glycogen Phosphorylase (PYGL) Liver glycogen phosphorylase PYGL_HUMAN
Type:
Homodimer
Mol. Mass.:
97153.98
Organism:
Homo sapiens (Human)
Description:
Dimers associate into a tetramer to form the enzymatically active phosphorylase A.
Residue:
847
  
Inhibitor
Name:
BDBM50256711
Synonyms:
(2S,3R)-3-(benzyloxy)-2-(3-(3-mesitylureido)-2-naphthamido)pentanoic acid | CHEMBL475378
Type:
Small organic molecule
Emp. Form.:
C33H35N3O5
Mol. Mass.:
553.6481
SMILES:
CC[C@@H](OCc1ccccc1)[C@H](NC(=O)c1cc2ccccc2cc1NC(=O)Nc1c(C)cc(C)cc1C)C(O)=O
: