Target
Macrophage colony-stimulating factor 1 receptor
Ligand
BDBM50256750
Substrate
Meas. Tech.
ChEMBL_519320 (CHEMBL947772)
IC50
5±n/a nM
Citation
 Lyne, PDAquila, BCook, DJDakin, LAEzhuthachan, JIoannidis, SPontz, TSu, MYe, QZheng, XBlock, MHCowen, SDeegan, TLLee, JWScott, DACusteau, DDrew, LPoondru, SShen, MWu, A Identification of amidoheteroaryls as potent inhibitors of mutant (V600E) B-Raf kinase with in vivo activity. Bioorg Med Chem Lett 19:1026-9 (2009)  
Target
Name:
Macrophage colony-stimulating factor 1 receptor
Synonyms:
CSF1R FMS Macrophage colony stimulating factor receptor Macrophage colony-stimulating factor 1 receptor (c-FMS) Proto-oncogene c-Fms c-fms | cFMS
Type:
Protein
Mol. Mass.:
107979.48
Organism:
Homo sapiens (Human)
Description:
P07333
Residue:
972
  
Inhibitor
Name:
BDBM50256750
Synonyms:
CHEMBL475817 | N-(6-amino-5-chloropyridin-3-yl)-2-chloro-5-(3-(trifluoromethyl)benzamido)benzamide
Type:
Small organic molecule
Emp. Form.:
C20H13Cl2F3N4O2
Mol. Mass.:
469.244
SMILES:
Nc1ncc(NC(=O)c2cc(NC(=O)c3cccc(c3)C(F)(F)F)ccc2Cl)cc1Cl
: