Target
Mu-type opioid receptor
Ligand
BDBM50265490
Substrate
Meas. Tech.
ChEMBL_559849 (CHEMBL1021530)
Ki
8.3±n/a nM
Citation
 Zheng, YAkgün, EHarikumar, KGHopson, JPowers, MDLunzer, MMMiller, LJPortoghese, PS Induced association of mu opioid (MOP) and type 2 cholecystokinin (CCK2) receptors by novel bivalent ligands. J Med Chem 52:247-58 (2009)  
Target
Name:
Mu-type opioid receptor
Synonyms:
M-OR-1 MOR-1 MUOR1 Mu opiate receptor OPRM1 hMOP | mu-type opioid receptor isoform MOR-1
Type:
G Protein-Coupled Receptor (GPCR)
Mol. Mass.:
44789.51
Organism:
Homo sapiens (Human)
Description:
P35372
Residue:
400
  
Inhibitor
Name:
BDBM50265490
Synonyms:
CHEMBL501238 | N-{m-[R(+)-1]Ureaphenoxy}ethyldiglycolamidehydrazide-N'-oxymorphyldiglycolamidedihydrazide
Type:
Small organic molecule
Emp. Form.:
C50H55N9O12
Mol. Mass.:
974.0248
SMILES:
CN1CC[C@]23[C@H]4Oc5cc(O)cc(C[C@@H]1[C@]2(O)CC[C@@H]4NC(=O)COCC(=O)NNC(=O)COCC(=O)NCCOc1cccc(NC(=O)N[C@@H]2N=C(c4ccccc4)c4ccccc4N(C)C2=O)c1)c35
: