Target
Integrin alpha-V
Ligand
BDBM50265535
Substrate
Meas. Tech.
ChEMBL_559860 (CHEMBL1021541)
IC50
85.45±n/a nM
Citation
 Liu, ZYan, YChin, FTWang, FChen, X Dual integrin and gastrin-releasing peptide receptor targeted tumor imaging using 18F-labeled PEGylated RGD-bombesin heterodimer 18F-FB-PEG3-Glu-RGD-BBN. J Med Chem 52:425-32 (2009)  
Target
Name:
Integrin alpha-V
Synonyms:
ITAV_HUMAN Integrin alpha-V/alpha-5 VNRA Vitronectin receptor | Vitronectin receptor subunit alpha
Type:
PROTEIN
Mol. Mass.:
116024.92
Organism:
Homo sapiens (Human)
Description:
ChEMBL_582336
Residue:
1048
  
Inhibitor
Name:
BDBM50265535
Synonyms:
2-((2R,8R,11R,14S)-11-((5R,8S,11R,17R,20S,23R,26S)-11-((1H-imidazol-4-yl)methyl)-23-((1H-indol-3-yl)methyl)-26-(3-amino-3-oxopropyl)-38-(2-(2-(2-(2-aminoethoxy)ethoxy)ethoxy)acetamido)-5-carbamoyl-8-isobutyl-17-isopropyl-20-methyl-7,10,13,16,19,22,25,28,35,39-decaoxo-2-thia-6,9,12,15,18,21,24,27,34,40-decaazatetratetracontan-44-yl)-8-(3-guanidinopropyl)-14-(4-hydroxybenzyl)-3,6,9,12,15-pentaoxo-1,4,7,10,13-pentaazacyclopentadecan-2-yl)acetic acid | CHEMBL499998
Type:
Small organic molecule
Emp. Form.:
C89H137N25O24S
Mol. Mass.:
1973.258
SMILES:
CSCC[C@@H](NC(=O)[C@H](CC(C)C)NC(=O)[C@@H](Cc1cnc[nH]1)NC(=O)CNC(=O)[C@H](NC(=O)[C@H](C)NC(=O)[C@@H](Cc1c[nH]c2ccccc12)NC(=O)[C@H](CCC(N)=O)NC(=O)CCCCCNC(=O)CCC(NC(=O)COCCOCCOCCN)C(=O)NCCCC[C@H]1NC(=O)[C@@H](CCCN=C(N)N)NC(=O)CNC(=O)[C@@H](CC(O)=O)NC(=O)[C@H](Cc2ccc(O)cc2)NC1=O)C(C)C)C(N)=O
: