Target
Beta-1 adrenergic receptor
Ligand
BDBM50255801
Substrate
Meas. Tech.
ChEMBL_516105 (CHEMBL983249)
Ki
7700±n/a nM
Citation
 Marona, HSzkaradek, NRapacz, AFilipek, BDybala, MSiwek, ACegla, MSzneler, E Preliminary evaluation of pharmacological properties of some xanthone derivatives. Bioorg Med Chem 17:1345-52 (2009)  
Target
Name:
Beta-1 adrenergic receptor
Synonyms:
ADRB1R, B1AR Adrb1 Adrenergic receptor beta Beta-1 adrenoreceptor adrenergic Beta1,2
Type:
Protein
Mol. Mass.:
50486.84
Organism:
Rattus norvegicus (Rat)
Description:
P18090
Residue:
466
  
Inhibitor
Name:
BDBM50255801
Synonyms:
4-(3-(Allylamino)propoxy)-9H-xanthen-9-one hydrochloride | CHEMBL517532
Type:
Small organic molecule
Emp. Form.:
C19H19NO3
Mol. Mass.:
309.3591
SMILES:
C=CCNCCCOc1cccc2c1oc1ccccc1c2=O
: