Target
TGF-beta receptor type-1
Ligand
BDBM50255957
Substrate
Meas. Tech.
ChEMBL_516219 (CHEMBL985076)
Ki
15.2±n/a nM
Citation
 Bonafoux, DChuaqui, CBoriack-Sjodin, PAFitch, CHankins, GJosiah, SBlack, CHetu, GLing, LLee, WC 2-Aminoimidazoles inhibitors of TGF-beta receptor 1. Bioorg Med Chem Lett 19:912-6 (2009)  
Target
Name:
TGF-beta receptor type-1
Synonyms:
ALK-5 Activin A receptor type II-like protein kinase of 53kD SKR4 TGF-beta receptor type I TGFBR1 TGFR1_HUMAN Transforming growth factor-beta receptor type I
Type:
enzyme
Mol. Mass.:
55968.24
Organism:
Homo sapiens (Human)
Description:
P36897
Residue:
503
  
Inhibitor
Name:
BDBM50255957
Synonyms:
1-(4-(5-([1,2,4]triazolo[1,5-a]pyridin-6-yl)-4-(5-fluoro-6-methylpyridin-2-yl)-1H-imidazol-2-yl)piperazin-1-yl)ethanone | CHEMBL480582
Type:
Small organic molecule
Emp. Form.:
C21H21FN8O
Mol. Mass.:
420.4428
SMILES:
CC(=O)N1CCN(CC1)c1nc(c([nH]1)-c1ccc2ncnn2c1)-c1ccc(F)c(C)n1
: