Target
Sterol O-acyltransferase 1
Ligand
BDBM50276486
Substrate
Meas. Tech.
ChEMBL_540911 (CHEMBL1027336)
IC50
81±n/a nM
Citation
 Asano, SBan, HKino, KIoriya, KMuraoka, M Novel 1,4-diarylpiperidine-4-methylureas as anti-hyperlipidemic agents: dual effectors on acyl-CoA:cholesterol O-acyltransferase and low-density lipoprotein receptor expression. Bioorg Med Chem Lett 19:1062-5 (2009)  
Target
Name:
Sterol O-acyltransferase 1
Synonyms:
ACACT ACAT Acetyl-CoA acetyltransferase, mitochondrial Acyl-CoA: cholesterol acyltransferase (ACAT) Cholesterol acyltransferase 1 SOAT1 STAT
Type:
Multi-pass membrane protein may form homo- or heterodimers.
Mol. Mass.:
64751.94
Organism:
Homo sapiens (Human)
Description:
P35610
Residue:
550
  
Inhibitor
Name:
BDBM50276486
Synonyms:
1-(3-amino-2,6-diisopropylphenyl)-3-((1-(2-methoxyphenyl)-4-(3-methoxyphenyl)piperidin-4-yl)methyl)urea dihydrochloride | CHEMBL499122
Type:
Small organic molecule
Emp. Form.:
C33H44N4O3
Mol. Mass.:
544.7275
SMILES:
COc1cccc(c1)C1(CNC(=O)Nc2c(ccc(N)c2C(C)C)C(C)C)CCN(CC1)c1ccccc1OC
: