Target
Phenylethanolamine N-methyltransferase
Ligand
BDBM50276413
Substrate
Meas. Tech.
ChEMBL_541078 (CHEMBL1024778)
Ki
40±n/a nM
Citation
 Wu, QCaine, JMThomson, SASlavica, MGrunewald, GLMcLeish, MJ Time-dependent inactivation of human phenylethanolamine N-methyltransferase by 7-isothiocyanatotetrahydroisoquinoline. Bioorg Med Chem Lett 19:1071-4 (2009)  
Target
Name:
Phenylethanolamine N-methyltransferase
Synonyms:
Noradrenaline N-methyltransferase PNMT PNMTase | Phenylethanolamine N-Methyltransferase (PNMT)
Type:
Enzyme
Mol. Mass.:
30852.66
Organism:
Homo sapiens (Human)
Description:
Residue:
282
  
Inhibitor
Name:
BDBM50276413
Synonyms:
7-isothiocyanatotetrahydroisoquinoline | CHEMBL459366
Type:
Small organic molecule
Emp. Form.:
C10H10N2S
Mol. Mass.:
190.265
SMILES:
S=C=Nc1ccc2CCNCc2c1
: