Target
Sodium- and chloride-dependent glycine transporter 1
Ligand
BDBM50248062
Substrate
Meas. Tech.
ChEMBL_543461 (CHEMBL1016009)
IC50
2.9±n/a nM
Citation
 Wolkenberg, SEZhao, ZWisnoski, DDLeister, WHO'Brien, JLemaire, WWilliams, DLJacobson, MASur, CKinney, GGPettibone, DJTiller, PRSmith, SGibson, CMa, BKPolsky-Fisher, SLLindsley, CWHartman, GD Discovery of GlyT1 inhibitors with improved pharmacokinetic properties. Bioorg Med Chem Lett 19:1492-5 (2009)  
Target
Name:
Sodium- and chloride-dependent glycine transporter 1
Synonyms:
GlyT-1 Glycine Transporters (GlyT1c) SC6A9_HUMAN Sodium- and chloride-dependent glycine transporter 1 Sodium- and chloride-dependent glycine transporter 1 (GlyT1c) Solute carrier family 6 member 9
Type:
Enzyme
Mol. Mass.:
78270.54
Organism:
Homo sapiens (Human)
Description:
P48067
Residue:
706
  
Inhibitor
Name:
BDBM50248062
Synonyms:
2,4-dichloro-N-((1-(propylsulfonyl)-4-((tetrahydro-2H-pyran-2-yl)methyl)piperidin-4-yl)methyl)benzamide | CHEMBL518238
Type:
Small organic molecule
Emp. Form.:
C22H32Cl2N2O4S
Mol. Mass.:
491.471
SMILES:
CCCS(=O)(=O)N1CCC(CNC(=O)c2ccc(Cl)cc2Cl)(CC2CCCCO2)CC1
: