Target
Acetylcholine receptor subunit alpha
Ligand
BDBM50248045
Substrate
Meas. Tech.
ChEMBL_566266 (CHEMBL953569)
IC50
125892.54±n/a nM
Citation
 Enz, AFeuerbach, DFrederiksen, MUGentsch, CHurth, KMüller, WNozulak, JRoy, BL Gamma-lactams--a novel scaffold for highly potent and selective alpha 7 nicotinic acetylcholine receptor agonists. Bioorg Med Chem Lett 19:1287-91 (2009)  
Target
Name:
Acetylcholine receptor subunit alpha
Synonyms:
ACHA_HUMAN Acetylcholine receptor protein alpha chain CHNRA Cholinergic, Nicotinic Alpha1Beta1DeltaGamma Nicotinic acetylcholine receptor alpha-1/beta-1 Nicotinic acetylcholine receptor alpha2/beta4 n-AChR
Type:
Ion channel
Mol. Mass.:
54542.01
Organism:
Homo sapiens (Human)
Description:
Residue:
482
  
Inhibitor
Name:
BDBM50248045
Synonyms:
(S)-1-(2-fluorophenyl)ethyl (S)-quinuclidin-3-ylcarbamate | CHEMBL499536
Type:
Small organic molecule
Emp. Form.:
C16H21FN2O2
Mol. Mass.:
292.3485
SMILES:
C[C@H](OC(=O)N[C@@H]1CN2CCC1CC2)c1ccccc1F
: