Target
Glucose-6-phosphate 1-dehydrogenase
Ligand
BDBM50223368
Substrate
Meas. Tech.
ChEMBL_542429 (CHEMBL1010666)
Ki
1700±n/a nM
Citation
 Cordeiro, ATThiemann, OHMichels, PA Inhibition of Trypanosoma brucei glucose-6-phosphate dehydrogenase by human steroids and their effects on the viability of cultured parasites. Bioorg Med Chem 17:2483-9 (2009)  
Target
Name:
Glucose-6-phosphate 1-dehydrogenase
Synonyms:
Type:
PROTEIN
Mol. Mass.:
59057.43
Organism:
Trypanosoma brucei
Description:
ChEMBL_542430
Residue:
521
  
Inhibitor
Name:
BDBM50223368
Synonyms:
3beta-hydroxyandrost-5-en-17-one DHEAS Prasterone
Type:
Small organic molecule
Emp. Form.:
C19H28O2
Mol. Mass.:
288.4244
SMILES:
C[C@]12CC[C@H]3[C@@H](CC=C4C[C@@H](O)CC[C@]34C)[C@@H]1CCC2=O
: