Target
Replicase polyprotein 1ab
Ligand
BDBM50258183
Substrate
Meas. Tech.
ChEMBL_566013 (CHEMBL964112)
IC50
>50000±n/a nM
Citation
 Lee, CLee, JMLee, NRJin, BSJang, KJKim, DEJeong, YJChong, Y Aryl diketoacids (ADK) selectively inhibit duplex DNA-unwinding activity of SARS coronavirus NTPase/helicase. Bioorg Med Chem Lett 19:1636-8 (2009)  
Target
Name:
Replicase polyprotein 1ab
Synonyms:
3C-like proteinase 3C-like proteinase (SARS-CoV 3Cpro) 3CLp GFL Guanine-N7 methyltransferase Helicase Leader protein Non-structural protein 10 Non-structural protein 3 Non-structural protein 6 Non-structural protein 8 ORF1ab polyprotein PL2-PRO Pol R1AB_SARS RdRp SARS coronavirus main proteinase nsp1 nsp12 nsp14 nsp16 nsp3 nsp5 nsp7 nsp9 pp1ab | rep
Type:
Protein
Mol. Mass.:
790250.81
Organism:
Human SARS coronavirus (SARS-CoV) (Severe acute respiratory syndrome coronavirus)
Description:
P0C6X7
Residue:
7073
  
Inhibitor
Name:
BDBM50258183
Synonyms:
4-(3-(4-chlorobenzylamino)phenyl)-2-hydroxy-4-oxobut-2-enoic acid | CHEMBL522710
Type:
Small organic molecule
Emp. Form.:
C17H14ClNO4
Mol. Mass.:
331.75
SMILES:
OC(=O)C(=O)CC(=O)c1cccc(NCc2ccc(Cl)cc2)c1
: