Target
Metabotropic glutamate receptor 1
Ligand
BDBM50258224
Substrate
Meas. Tech.
ChEMBL_566314 (CHEMBL956824)
EC50
20±n/a nM
Citation
 Vieira, EHuwyler, JJolidon, SKnoflach, FMutel, VWichmann, J Fluorinated 9H-xanthene-9-carboxylic acid oxazol-2-yl-amides as potent, orally available mGlu1 receptor enhancers. Bioorg Med Chem Lett 19:1666-9 (2009)  
Target
Name:
Metabotropic glutamate receptor 1
Synonyms:
GRM1_RAT Grm1 Metabotropic glutamate receptor Mglur1 metabotropic glutamate 1/5-D metabotropic glutamate receptor 1 isoform alpha precursor
Type:
Enzyme Catalytic Domain
Mol. Mass.:
133240.47
Organism:
RAT
Description:
metabotropic glutamate 1/2 0 RAT::P23385
Residue:
1199
  
Inhibitor
Name:
BDBM50258224
Synonyms:
CHEMBL522875 | rac-2-fluoro-N-(5-(trifluoromethyl)oxazol-2-yl)-9H-xanthene-9-carboxamide
Type:
Small organic molecule
Emp. Form.:
C18H10F4N2O3
Mol. Mass.:
378.2772
SMILES:
Fc1ccc2Oc3ccccc3C(C(=O)Nc3ncc(o3)C(F)(F)F)c2c1
: