Target
Cholecystokinin receptor type A
Ligand
BDBM50278816
Substrate
Meas. Tech.
ChEMBL_564593 (CHEMBL964033)
IC50
288±n/a nM
Citation
 Lassiani, LPavan, MVBerti, FKokotos, GMarkidis, TMennuni, LMakovec, FVarnavas, A Anthranilic acid based CCK1 receptor antagonists: blocking the receptor with the same 'words' of the endogenous ligand. Bioorg Med Chem 17:2336-50 (2009)  
Target
Name:
Cholecystokinin receptor type A
Synonyms:
CCKAR_RAT Cholecystokinin peripheral Cholecystokinin receptor type A
Type:
Enzyme Catalytic Domain
Mol. Mass.:
49676.37
Organism:
RAT
Description:
Cholecystokinin central 0 RAT::P30551
Residue:
444
  
Inhibitor
Name:
BDBM50278816
Synonyms:
2-(R,S)-{2-[(1H-Indole-2-carbonyl)-amino]-benzoylamino}-3-methyl-butyric acid | CHEMBL496066
Type:
Small organic molecule
Emp. Form.:
C21H21N3O4
Mol. Mass.:
379.4091
SMILES:
CC(C)C(NC(=O)c1ccccc1NC(=O)c1cc2ccccc2[nH]1)C(O)=O
: