Target
cGMP-specific 3',5'-cyclic phosphodiesterase
Ligand
BDBM50257381
Substrate
Meas. Tech.
ChEMBL_562503 (CHEMBL1011852)
IC50
320±n/a nM
Citation
 Guo, JWatson, AKempson, JCarlsen, MBarbosa, JStebbins, KLee, DDodd, JNadler, SGMcKinnon, MBarrish, JPitts, WJ Identification of potent pyrimidine inhibitors of phosphodiesterase 7 (PDE7) and their ability to inhibit T cell proliferation. Bioorg Med Chem Lett 19:1935-8 (2009)  
Target
Name:
cGMP-specific 3',5'-cyclic phosphodiesterase
Synonyms:
3',5'-cyclic phosphodiesterase PDE5 PDE5A_HUMAN Phosphodiesterase 5 (PDE5) Phosphodiesterase 5A (PDE5A) cGMP-specific 3',5'-cyclic phosphodiesterase
Type:
Protein
Mol. Mass.:
99975.83
Organism:
Homo sapiens (Human)
Description:
O76074
Residue:
875
  
Inhibitor
Name:
BDBM50257381
Synonyms:
CHEMBL493109 | ethyl 2-(4-(3,4-dimethoxybenzylamino)-6-(piperazin-1-yl)pyrimidin-2-ylamino)-4-methylthiazole-5-carboxylate
Type:
Small organic molecule
Emp. Form.:
C24H31N7O4S
Mol. Mass.:
513.612
SMILES:
CCOC(=O)c1sc(Nc2nc(NCc3ccc(OC)c(OC)c3)cc(n2)N2CCNCC2)nc1C
: