Target
cGMP-specific 3',5'-cyclic phosphodiesterase
Ligand
BDBM50257322
Substrate
Meas. Tech.
ChEMBL_562503 (CHEMBL1011852)
IC50
65±n/a nM
Citation
 Guo, JWatson, AKempson, JCarlsen, MBarbosa, JStebbins, KLee, DDodd, JNadler, SGMcKinnon, MBarrish, JPitts, WJ Identification of potent pyrimidine inhibitors of phosphodiesterase 7 (PDE7) and their ability to inhibit T cell proliferation. Bioorg Med Chem Lett 19:1935-8 (2009)  
Target
Name:
cGMP-specific 3',5'-cyclic phosphodiesterase
Synonyms:
3',5'-cyclic phosphodiesterase PDE5 PDE5A_HUMAN Phosphodiesterase 5 (PDE5) Phosphodiesterase 5A (PDE5A) cGMP-specific 3',5'-cyclic phosphodiesterase
Type:
Protein
Mol. Mass.:
99975.83
Organism:
Homo sapiens (Human)
Description:
O76074
Residue:
875
  
Inhibitor
Name:
BDBM50257322
Synonyms:
CHEMBL522338 | ethyl 4-methyl-2-(4-(methylamino)-6-(4-sulfamoylbenzylamino)pyrimidin-2-ylamino)thiazole-5-carboxylate
Type:
Small organic molecule
Emp. Form.:
C19H23N7O4S2
Mol. Mass.:
477.56
SMILES:
CCOC(=O)c1sc(Nc2nc(NC)cc(NCc3ccc(cc3)S(N)(=O)=O)n2)nc1C
: