Target
Dipeptidyl peptidase 4
Ligand
BDBM50249479
Substrate
Meas. Tech.
ChEMBL_499548 (CHEMBL1010596)
IC50
11±n/a nM
Citation
 Ammirati, MJAndrews, KMBoyer, DDBrodeur, AMDanley, DEDoran, SDHulin, BLiu, SMcPherson, RKOrena, SJParker, JCPolivkova, JQiu, XSoglia, CBTreadway, JLVanVolkenburg, MAWilder, DCPiotrowski, DW (3,3-Difluoro-pyrrolidin-1-yl)-[(2S,4S)-(4-(4-pyrimidin-2-yl-piperazin-1-yl)-pyrrolidin-2-yl]-methanone: a potent, selective, orally active dipeptidyl peptidase IV inhibitor. Bioorg Med Chem Lett 19:1991-5 (2009)  
Target
Name:
Dipeptidyl peptidase 4
Synonyms:
ADABP Adenosine deaminase complexing protein 2 CD_antigen=CD26 DPP4 DPPIV Dipeptidyl peptidase 4 (DPP IV) Dipeptidyl peptidase 4 (DPP4) Dipeptidyl peptidase 4 membrane form Dipeptidyl peptidase IV Dipeptidyl peptidase IV (DDP-IV) Dipeptidyl peptidase IV membrane form Dipeptidyl peptidase-IV (DPP-4) T-cell activation antigen CD26 | TP103
Type:
Enzyme
Mol. Mass.:
88271.01
Organism:
Homo sapiens (Human)
Description:
P27487
Residue:
766
  
Inhibitor
Name:
BDBM50249479
Synonyms:
2-(4-{(3S,5S)-5-[(3,3-difluoropyrrolidin-1-yl)carbonyl]pyrrolidin-3-yl}piperazin-1-yl)pyrimidine PF-00734200 | cis-(3,3-Difluoro-pyrrolidin-1-yl)-[(2S,4S)-(4-(4-pyrimidin-2-yl-piperazin-1-yl)-pyrrolidin-2-yl]-methanone
Type:
Small organic molecule
Emp. Form.:
C17H24F2N6O
Mol. Mass.:
366.4089
SMILES:
FC1(F)CCN(C1)C(=O)[C@@H]1C[C@@H](CN1)N1CCN(CC1)c1ncccn1
: