Target
Dual specificity tyrosine-phosphorylation-regulated kinase 1A
Ligand
BDBM50278599
Substrate
Meas. Tech.
ChEMBL_564832 (CHEMBL954298)
IC50
20000±n/a nM
Citation
 Koo, KAKim, NDChon, YSJung, MSLee, BJKim, JHSong, WJ QSAR analysis of pyrazolidine-3,5-diones derivatives as Dyrk1A inhibitors. Bioorg Med Chem Lett 19:2324-8 (2009)  
Target
Name:
Dual specificity tyrosine-phosphorylation-regulated kinase 1A
Synonyms:
DYR1A_HUMAN DYRK1A Dual specificity YAK1-related kinase 1A (Dyrk1A) Dual-specificity tyrosine-phosphorylation regulated kinase 1A HP86 MNBH
Type:
Enzyme
Mol. Mass.:
85616.61
Organism:
Homo sapiens (Human)
Description:
Q13627
Residue:
763
  
Inhibitor
Name:
BDBM50278599
Synonyms:
4-(4-chlorobenzylidene)-1-(3,4-dichlorophenyl)pyrazolidine-3,5-dione | CHEMBL469776
Type:
Small organic molecule
Emp. Form.:
C16H9Cl3N2O2
Mol. Mass.:
367.614
SMILES:
Clc1ccc(C=C2C(=O)NN(C2=O)c2ccc(Cl)c(Cl)c2)cc1
: