Target
Adenosine receptor A3
Ligand
BDBM50256925
Substrate
Meas. Tech.
ChEMBL_562699 (CHEMBL1012734)
Ki
3.3±n/a nM
Citation
 Colotta, VLenzi, OCatarzi, DVarano, FFilacchioni, GMartini, CTrincavelli, LCiampi, OPugliese, AMTraini, CPedata, FMorizzo, EMoro, S Pyrido[2,3-e]-1,2,4-triazolo[4,3-a]pyrazin-1-one as a new scaffold to develop potent and selective human A3 adenosine receptor antagonists. Synthesis, pharmacological evaluation, and ligand-receptor modeling studies. J Med Chem 52:2407-19 (2009)  
Target
Name:
Adenosine receptor A3
Synonyms:
A3 adenosine receptor (hA3) ADORA3 | Adenosine A3 receptor (A3AR)
Type:
G Protein-Coupled Receptor (GPCR)
Mol. Mass.:
36197.32
Organism:
Homo sapiens (Human)
Description:
P0DMS8
Residue:
318
  
Inhibitor
Name:
BDBM50256925
Synonyms:
2-(4-methoxyphenyl)pyrido[2,3-e][1,2,4]triazolo[4,3-a]pyrazine-1,4(2H,5H)-dione | CHEMBL475791
Type:
Small organic molecule
Emp. Form.:
C15H11N5O3
Mol. Mass.:
309.2795
SMILES:
COc1ccc(cc1)-n1nc2n(c3cccnc3[nH]c2=O)c1=O
: