Target
Adenosine receptor A3
Ligand
BDBM50189813
Substrate
Meas. Tech.
ChEMBL_562699 (CHEMBL1012734)
Ki
22±n/a nM
Citation
 Colotta, VLenzi, OCatarzi, DVarano, FFilacchioni, GMartini, CTrincavelli, LCiampi, OPugliese, AMTraini, CPedata, FMorizzo, EMoro, S Pyrido[2,3-e]-1,2,4-triazolo[4,3-a]pyrazin-1-one as a new scaffold to develop potent and selective human A3 adenosine receptor antagonists. Synthesis, pharmacological evaluation, and ligand-receptor modeling studies. J Med Chem 52:2407-19 (2009)  
Target
Name:
Adenosine receptor A3
Synonyms:
A3 adenosine receptor (hA3) ADORA3 | Adenosine A3 receptor (A3AR)
Type:
G Protein-Coupled Receptor (GPCR)
Mol. Mass.:
36197.32
Organism:
Homo sapiens (Human)
Description:
P0DMS8
Residue:
318
  
Inhibitor
Name:
BDBM50189813
Synonyms:
4-benzamido-6-nitro-2-phenyl-1,2-dihydro-1,2,4-triazolo[4,3-a]quinoxalin-1-one N-(6-nitro-1-oxo-2-phenyl-1,2-dihydro-[1,2,4]triazolo[4,3-a]quinoxalin-4-yl)benzamide
Type:
Small organic molecule
Emp. Form.:
C22H14N6O4
Mol. Mass.:
426.3844
SMILES:
[O-][N+](=O)c1cccc2c1nc(NC(=O)c1ccccc1)c1nn(-c3ccccc3)c(=O)n21
: