Target
Adenosine receptor A1
Ligand
BDBM50256972
Substrate
Meas. Tech.
ChEMBL_562705 (CHEMBL1012740)
Ki
3.1±n/a nM
Citation
 Colotta, VLenzi, OCatarzi, DVarano, FFilacchioni, GMartini, CTrincavelli, LCiampi, OPugliese, AMTraini, CPedata, FMorizzo, EMoro, S Pyrido[2,3-e]-1,2,4-triazolo[4,3-a]pyrazin-1-one as a new scaffold to develop potent and selective human A3 adenosine receptor antagonists. Synthesis, pharmacological evaluation, and ligand-receptor modeling studies. J Med Chem 52:2407-19 (2009)  
Target
Name:
Adenosine receptor A1
Synonyms:
AA1R_BOVIN ADENOSINE A1 high ADORA1 | Adenosine A1 receptor
Type:
Enzyme Catalytic Domain
Mol. Mass.:
36602.99
Organism:
BOVINE
Description:
ADENOSINE 0 BOVINE::P28190
Residue:
326
  
Inhibitor
Name:
BDBM50256972
Synonyms:
4-amino-2-phenylpyrido[2,3-e][1,2,4]triazolo[4,3-a]pyrazin-1(2H)-one | CHEMBL474636
Type:
Small organic molecule
Emp. Form.:
C14H10N6O
Mol. Mass.:
278.2688
SMILES:
Nc1nc2ncccc2n2c1nn(-c1ccccc1)c2=O
: