Target
Thromboxane A2 receptor
Ligand
BDBM50278038
Substrate
Meas. Tech.
ChEMBL_501283 (CHEMBL971469)
Ki
79±n/a nM
Citation
 Leblanc, YRoy, PDufresne, CLachance, NWang, ZO'Neill, GGreig, GDenis, DMathieu, MCSlipetz, DSawyer, NTsou, N Discovery of potent and selective DP1 receptor antagonists in the azaindole series. Bioorg Med Chem Lett 19:2125-8 (2009)  
Target
Name:
Thromboxane A2 receptor
Synonyms:
Prostanoid TP receptor TBXA2R Thromboxane Thromboxane Beta
Type:
Enyzme
Mol. Mass.:
37445.28
Organism:
Homo sapiens (Human)
Description:
P21731
Residue:
343
  
Inhibitor
Name:
BDBM50278038
Synonyms:
(+/-)-2-(5-(4-chlorophenylthio)-4-(methylthio)-6,7,8,9-tetrahydropyrido[3,2-b]indolizin-6-yl)acetic acid | CHEMBL482548
Type:
Small organic molecule
Emp. Form.:
C20H19ClN2O2S2
Mol. Mass.:
418.96
SMILES:
CSc1ccnc2n3CCCC(CC(O)=O)c3c(Sc3ccc(Cl)cc3)c12
: