Target
Prostaglandin D2 receptor
Ligand
BDBM50277989
Substrate
Meas. Tech.
ChEMBL_501282 (CHEMBL971468)
Ki
3.3±n/a nM
Citation
 Leblanc, YRoy, PDufresne, CLachance, NWang, ZO'Neill, GGreig, GDenis, DMathieu, MCSlipetz, DSawyer, NTsou, N Discovery of potent and selective DP1 receptor antagonists in the azaindole series. Bioorg Med Chem Lett 19:2125-8 (2009)  
Target
Name:
Prostaglandin D2 receptor
Synonyms:
PD2R_HUMAN Prostaglandin D2 Prostanoid DP receptor
Type:
Enzyme
Mol. Mass.:
40288.87
Organism:
Homo sapiens (Human)
Description:
Q13258
Residue:
359
  
Inhibitor
Name:
BDBM50277989
Synonyms:
(+/-)-2-(5-(4-bromophenylthio)-4-(methylsulfonyl)-6,7,8,9-tetrahydropyrido[3,2-b]indolizin-6-yl)acetic acid | CHEMBL483939
Type:
Small organic molecule
Emp. Form.:
C20H19BrN2O4S2
Mol. Mass.:
495.41
SMILES:
CS(=O)(=O)c1ccnc2n3CCCC(CC(O)=O)c3c(Sc3ccc(Br)cc3)c12
: