Target
Prostaglandin D2 receptor
Ligand
BDBM50277629
Substrate
Meas. Tech.
ChEMBL_501282 (CHEMBL971468)
Ki
0.390000±n/a nM
Citation
 Leblanc, YRoy, PDufresne, CLachance, NWang, ZO'Neill, GGreig, GDenis, DMathieu, MCSlipetz, DSawyer, NTsou, N Discovery of potent and selective DP1 receptor antagonists in the azaindole series. Bioorg Med Chem Lett 19:2125-8 (2009)  
Target
Name:
Prostaglandin D2 receptor
Synonyms:
PD2R_HUMAN Prostaglandin D2 Prostanoid DP receptor
Type:
Enzyme
Mol. Mass.:
40288.87
Organism:
Homo sapiens (Human)
Description:
Q13258
Residue:
359
  
Inhibitor
Name:
BDBM50277629
Synonyms:
2-(9-(2,4-dichlorophenylthio)-1-isopropyl-7,8-dihydro-6H-pyrido[3,4-b]pyrrolizin-8-yl)acetic acid | CHEMBL484779
Type:
Small organic molecule
Emp. Form.:
C21H20Cl2N2O2S
Mol. Mass.:
435.367
SMILES:
CC(C)c1nccc2n3CCC(CC(O)=O)c3c(Sc3ccc(Cl)cc3Cl)c12
: