Target
Muscarinic acetylcholine receptor M3
Ligand
BDBM50003638
Substrate
Meas. Tech.
ChEMBL_562970 (CHEMBL1015369)
IC50
<10000±n/a nM
Citation
 Lainé, DIMcCleland, BThomas, SNeipp, CUnderwood, BDufour, JWiddowson, KLPalovich, MRBlaney, FEFoley, JJWebb, EFLuttmann, MABurman, MBelmonte, KSalmon, M Discovery of novel 1-azoniabicyclo[2.2.2]octane muscarinic acetylcholine receptor antagonists. J Med Chem 52:2493-505 (2009)  
Target
Name:
Muscarinic acetylcholine receptor M3
Synonyms:
ACM3_HUMAN Cholinergic, muscarinic M3 Muscarinic receptor M3 | RecName: Full=Muscarinic acetylcholine receptor M3
Type:
Enzyme
Mol. Mass.:
66151.03
Organism:
Homo sapiens (Human)
Description:
P20309
Residue:
590
  
Inhibitor
Name:
BDBM50003638
Synonyms:
CHEMBL519652
Type:
Small organic molecule
Emp. Form.:
C30H36BrNO3
Mol. Mass.:
538.516
SMILES:
[Br-].COc1cccc(COCC[N+]23CCC(CC2)(CC3)C(O)(c2ccccc2)c2ccccc2)c1
: