Target
Muscarinic acetylcholine receptor M3
Ligand
BDBM50267471
Substrate
Meas. Tech.
ChEMBL_562970 (CHEMBL1015369)
IC50
122000±n/a nM
Citation
 Lainé, DIMcCleland, BThomas, SNeipp, CUnderwood, BDufour, JWiddowson, KLPalovich, MRBlaney, FEFoley, JJWebb, EFLuttmann, MABurman, MBelmonte, KSalmon, M Discovery of novel 1-azoniabicyclo[2.2.2]octane muscarinic acetylcholine receptor antagonists. J Med Chem 52:2493-505 (2009)  
Target
Name:
Muscarinic acetylcholine receptor M3
Synonyms:
ACM3_HUMAN Cholinergic, muscarinic M3 Muscarinic receptor M3 | RecName: Full=Muscarinic acetylcholine receptor M3
Type:
Enzyme
Mol. Mass.:
66151.03
Organism:
Homo sapiens (Human)
Description:
P20309
Residue:
590
  
Inhibitor
Name:
BDBM50267471
Synonyms:
3-(2-Hydroxy-2,2-diphenylethyl)-1-(2-phenylethyl)-1-azoniabicyclo[2.2.2]octane Bromide | CHEMBL478069
Type:
Small organic molecule
Emp. Form.:
C29H34NO
Mol. Mass.:
412.5858
SMILES:
OC(CC1C[N+]2(CCc3ccccc3)CCC1CC2)(c1ccccc1)c1ccccc1
: