Target
Cannabinoid receptor 1
Ligand
BDBM50267771
Substrate
Meas. Tech.
ChEMBL_563053 (CHEMBL1011883)
EC50
1±n/a nM
Citation
 Vachal, PFletcher, JMFong, TMHuang, CCLao, JXiao, JCShen, CPStrack, AMShearman, LStribling, SChen, RZFrassetto, ATong, XWang, JBall, RGTsou, NNHickey, GJThompson, DFFaidley, TDNicolich, SAchanfuo-Yeboah, JHora, DFHale, JJHagmann, WK 1-Sulfonyl-4-acylpiperazines as selective cannabinoid-1 receptor (CB1R) inverse agonists for the treatment of obesity. J Med Chem 52:2550-8 (2009)  
Target
Name:
Cannabinoid receptor 1
Synonyms:
CANN6 CB-R CNR CNR1_HUMAN Cannabinoid receptor Cannabinoid receptor 1 (brain)
Type:
G Protein-Coupled Receptor (GPCR)
Mol. Mass.:
52868.96
Organism:
Homo sapiens (Human)
Description:
P21554
Residue:
472
  
Inhibitor
Name:
BDBM50267771
Synonyms:
(4-(3,5-bis(trifluoromethyl)phenylsulfonyl)piperazin-1-yl)(cyclohexyl)methanone | CHEMBL489425
Type:
Small organic molecule
Emp. Form.:
C19H22F6N2O3S
Mol. Mass.:
472.445
SMILES:
FC(F)(F)c1cc(cc(c1)S(=O)(=O)N1CCN(CC1)C(=O)C1CCCCC1)C(F)(F)F
: