Target
Beta-secretase 1
Ligand
BDBM16775
Substrate
Meas. Tech.
ChEMBL_563264 (CHEMBL981021)
Ki
1129±n/a nM
Citation
 Ghosh, AK Harnessing nature's insight: design of aspartyl protease inhibitors from treatment of drug-resistant HIV to Alzheimer's disease. J Med Chem 52:2163-76 (2009)  
Target
Name:
Beta-secretase 1
Synonyms:
ASP2 Aspartyl protease 2 BACE1 Beta-secretase (BACE) Beta-secretase 1 (BACE 1) Beta-secretase 1 (BACE1) Beta-site amyloid precursor protein cleaving enzyme 1 Memapsin-2 beta-Secretase (BACE-1) | beta-Secretase (BACE1)
Type:
Protein
Mol. Mass.:
55755.10
Organism:
Homo sapiens (Human)
Description:
P56817
Residue:
501
  
Inhibitor
Name:
BDBM16775
Synonyms:
CHEMBL273916 tert-butyl N-[(1R)-1-{[(1R,3S,4S)-1-{[(1S)-1-(benzylcarbamoyl)-2-methylpropyl]carbamoyl}-3-hydroxy-1,6-dimethylheptan-4-yl]carbamoyl}-2-methanesulfonylethyl]carbamate
Type:
Small organic molecule
Emp. Form.:
C31H52N4O8S
Mol. Mass.:
640.832
SMILES:
CC(C)C[C@H](NC(=O)[C@H](CS(C)(=O)=O)NC(=O)OC(C)(C)C)[C@@H](O)C[C@@H](C)C(=O)N[C@@H](C(C)C)C(=O)NCc1ccccc1
: