Target
Beta-secretase 1
Ligand
BDBM16270
Substrate
Meas. Tech.
ChEMBL_563264 (CHEMBL981021)
Ki
14±n/a nM
Citation
 Ghosh, AK Harnessing nature's insight: design of aspartyl protease inhibitors from treatment of drug-resistant HIV to Alzheimer's disease. J Med Chem 52:2163-76 (2009)  
Target
Name:
Beta-secretase 1
Synonyms:
ASP2 Aspartyl protease 2 BACE1 Beta-secretase (BACE) Beta-secretase 1 (BACE 1) Beta-secretase 1 (BACE1) Beta-site amyloid precursor protein cleaving enzyme 1 Memapsin-2 beta-Secretase (BACE-1) | beta-Secretase (BACE1)
Type:
Protein
Mol. Mass.:
55755.10
Organism:
Homo sapiens (Human)
Description:
P56817
Residue:
501
  
Inhibitor
Name:
BDBM16270
Synonyms:
(2R,4S,5S)-N-[(1S)-1-(benzylcarbamoyl)-2-methylpropyl]-4-hydroxy-2,7-dimethyl-5-{[(4S,7S,12E)-2,5,9-trioxo-4-(propan-2-yl)-1-oxa-3,6,10-triazacyclohexadec-12-en-7-yl]formamido}octanamide amide-urethane derived inhibitor 3c
Type:
Small organic molecule
Emp. Form.:
C38H60N6O8
Mol. Mass.:
728.9184
SMILES:
CC(C)C[C@H](NC(=O)[C@@H]1CC(=O)NC\C=C\CCCOC(=O)N[C@@H](C(C)C)C(=O)N1)[C@@H](O)C[C@@H](C)C(=O)N[C@@H](C(C)C)C(=O)NCc1ccccc1
: