Target
Nociceptin receptor
Ligand
BDBM50259055
Substrate
Meas. Tech.
ChEMBL_500674 (CHEMBL966890)
Ki
13±n/a nM
Citation
 Ho, GDAnthes, JBercovici, ACaldwell, JPCheng, KCCui, XFawzi, AFernandez, XGreenlee, WJHey, JKorfmacher, WLu, SXMcLeod, RLNg, FTorhan, ASTan, ZTulshian, DVarty, GBXu, XZhang, H The discovery of tropane derivatives as nociceptin receptor ligands for the management of cough and anxiety. Bioorg Med Chem Lett 19:2519-23 (2009)  
Target
Name:
Nociceptin receptor
Synonyms:
KOR-3 Mu-type opioid receptor (Mu) Nociceptin Receptor (ORL1 Receptor) Nociceptin receptor (ORL-1) Nociceptin/Orphanin FQ, NOP receptor OPIATE ORL-1 OPRL1 protein ORL1 Opioid receptor like-1 Orphanin FQ receptor (ORL1) | P41146
Type:
G Protein-Coupled Receptor (GPCR)
Mol. Mass.:
40702.87
Organism:
Homo sapiens (Human)
Description:
P41146
Residue:
370
  
Inhibitor
Name:
BDBM50259055
Synonyms:
8-((2-chloro-4-methylphenyl)(2-chlorophenyl)methyl)-3-((5-methoxypyridin-2-yl)methyl)-8-azabicyclo[3.2.1]octan-3-ol | CHEMBL466066
Type:
Small organic molecule
Emp. Form.:
C28H30Cl2N2O2
Mol. Mass.:
497.456
SMILES:
COc1ccc(CC2(O)CC3CCC(C2)N3C(c2ccccc2Cl)c2ccc(C)cc2Cl)nc1
: