Target
Nociceptin receptor
Ligand
BDBM50258879
Substrate
Meas. Tech.
ChEMBL_500674 (CHEMBL966890)
Ki
7.5±n/a nM
Citation
 Ho, GDAnthes, JBercovici, ACaldwell, JPCheng, KCCui, XFawzi, AFernandez, XGreenlee, WJHey, JKorfmacher, WLu, SXMcLeod, RLNg, FTorhan, ASTan, ZTulshian, DVarty, GBXu, XZhang, H The discovery of tropane derivatives as nociceptin receptor ligands for the management of cough and anxiety. Bioorg Med Chem Lett 19:2519-23 (2009)  
Target
Name:
Nociceptin receptor
Synonyms:
KOR-3 Mu-type opioid receptor (Mu) Nociceptin Receptor (ORL1 Receptor) Nociceptin receptor (ORL-1) Nociceptin/Orphanin FQ, NOP receptor OPIATE ORL-1 OPRL1 protein ORL1 Opioid receptor like-1 Orphanin FQ receptor (ORL1) | P41146
Type:
G Protein-Coupled Receptor (GPCR)
Mol. Mass.:
40702.87
Organism:
Homo sapiens (Human)
Description:
P41146
Residue:
370
  
Inhibitor
Name:
BDBM50258879
Synonyms:
9-benzhydryl-3-phenyl-9-azabicyclo[3.3.1]nonan-3-ol | CHEMBL466846
Type:
Small organic molecule
Emp. Form.:
C27H29NO
Mol. Mass.:
383.5253
SMILES:
OC1(CC2CCCC(C1)N2C(c1ccccc1)c1ccccc1)c1ccccc1
: