Target
Cholesteryl ester transfer protein
Ligand
BDBM50277884
Substrate
Meas. Tech.
ChEMBL_501358 (CHEMBL1010541)
IC50
125±n/a nM
Citation
 Rano, TASieber-McMaster, EPelton, PDYang, MDemarest, KTKuo, GH Design and synthesis of potent inhibitors of cholesteryl ester transfer protein (CETP) exploiting a 1,2,3,4-tetrahydroquinoline platform. Bioorg Med Chem Lett 19:2456-60 (2009)  
Target
Name:
Cholesteryl ester transfer protein
Synonyms:
CETP Cholesteryl ester transfer protein (CETP) | Lipid transfer protein I
Type:
Enzyme
Mol. Mass.:
54751.53
Organism:
Homo sapiens (Human)
Description:
P11597
Residue:
493
  
Inhibitor
Name:
BDBM50277884
Synonyms:
(R)-1-((R)-2,5-bis(3-(trifluoromethoxy)phenyl)-3,4-dihydroquinolin-1(2H)-yl)propan-2-ol | CHEMBL483145
Type:
Small organic molecule
Emp. Form.:
C26H23F6NO3
Mol. Mass.:
511.4561
SMILES:
C[C@@H](O)CN1[C@H](CCc2c1cccc2-c1cccc(OC(F)(F)F)c1)c1cccc(OC(F)(F)F)c1
: