Target
Beta-2 adrenergic receptor
Ligand
BDBM50243112
Substrate
Meas. Tech.
ChEMBL_497790 (CHEMBL1007086)
EC50
>1000±n/a nM
Citation
 Hattori, KToda, SImanishi, MItou, SNakajima, YWashizuka, KAraki, THamashima, HTomishima, YSakurai, MMatsui, SImamura, EUeshima, KYamamoto, TYamamoto, NIshikawa, HNakano, KUnami, NHamada, KMatsumura, YTakamura, F Discovery of highly potent and selective biphenylacylsulfonamide-based beta3-adrenergic receptor agonists and evaluation of physical properties as potential overactive bladder therapies: part 5. J Med Chem 52:3063-72 (2009)  
Target
Name:
Beta-2 adrenergic receptor
Synonyms:
ADRB2 ADRB2_HUMAN Beta-2 adrenoceptor | Beta-2 adrenoreceptor
Type:
Mol. Mass.:
46461.69
Organism:
Homo sapiens (Human)
Description:
P07550
Residue:
413
  
Inhibitor
Name:
BDBM50243112
Synonyms:
(R)-3-(cyclohexyloxy)-4'-(2-(2-hydroxy-2-(pyridin-3-yl)ethylamino)ethyl)biphenyl-4-carboxylic acid CHEMBL488224
Type:
Small organic molecule
Emp. Form.:
C28H32N2O4
Mol. Mass.:
460.5647
SMILES:
O[C@@H](CNCCc1ccc(cc1)-c1ccc(C(O)=O)c(OC2CCCCC2)c1)c1cccnc1
: