Target
Beta-2 adrenergic receptor
Ligand
BDBM50249663
Substrate
Meas. Tech.
ChEMBL_497790 (CHEMBL1007086)
EC50
1200±n/a nM
Citation
 Hattori, KToda, SImanishi, MItou, SNakajima, YWashizuka, KAraki, THamashima, HTomishima, YSakurai, MMatsui, SImamura, EUeshima, KYamamoto, TYamamoto, NIshikawa, HNakano, KUnami, NHamada, KMatsumura, YTakamura, F Discovery of highly potent and selective biphenylacylsulfonamide-based beta3-adrenergic receptor agonists and evaluation of physical properties as potential overactive bladder therapies: part 5. J Med Chem 52:3063-72 (2009)  
Target
Name:
Beta-2 adrenergic receptor
Synonyms:
ADRB2 ADRB2_HUMAN Beta-2 adrenoceptor | Beta-2 adrenoreceptor
Type:
Mol. Mass.:
46461.69
Organism:
Homo sapiens (Human)
Description:
P07550
Residue:
413
  
Inhibitor
Name:
BDBM50249663
Synonyms:
4'-[2-[[(2R)-2-(6-Amino-3-pyridinyl)-2-hydroxyethyl]amino]ethyl]-3-(isopropylthio)-N-(methylsulfonyl)-4-biphenylcarboxamide | CHEMBL490733
Type:
Small organic molecule
Emp. Form.:
C26H32N4O4S2
Mol. Mass.:
528.687
SMILES:
CC(C)Sc1cc(ccc1C(=O)NS(C)(=O)=O)-c1ccc(CCNC[C@H](O)c2cnccc2N)cc1
: