Target
Beta-3 adrenergic receptor
Ligand
BDBM50236184
Substrate
Meas. Tech.
ChEMBL_497812 (CHEMBL1007108)
EC50
1.2±n/a nM
Citation
 Hattori, KToda, SImanishi, MItou, SNakajima, YWashizuka, KAraki, THamashima, HTomishima, YSakurai, MMatsui, SImamura, EUeshima, KYamamoto, TYamamoto, NIshikawa, HNakano, KUnami, NHamada, KMatsumura, YTakamura, F Discovery of highly potent and selective biphenylacylsulfonamide-based beta3-adrenergic receptor agonists and evaluation of physical properties as potential overactive bladder therapies: part 5. J Med Chem 52:3063-72 (2009)  
Target
Name:
Beta-3 adrenergic receptor
Synonyms:
ADRB3 B3AR
Type:
PROTEIN
Mol. Mass.:
43072.49
Organism:
Canis familiaris
Description:
ChEMBL_497812
Residue:
405
  
Inhibitor
Name:
BDBM50236184
Synonyms:
(R)-4'-(2-(2-hydroxy-2-phenylethylamino)ethyl)-3-(isopropylthio)biphenyl-4-carboxylic acid CHEMBL271574
Type:
Small organic molecule
Emp. Form.:
C26H29NO3S
Mol. Mass.:
435.578
SMILES:
CC(C)Sc1cc(ccc1C(O)=O)-c1ccc(CCNC[C@H](O)c2ccccc2)cc1
: