Target
Adenosine receptor A2b
Ligand
BDBM50258805
Substrate
Meas. Tech.
ChEMBL_499866 (CHEMBL976198)
Ki
42.7±n/a nM
Citation
 Fernández, FCaamaño, OIsabel Nieto, MLópez, CGarcía-Mera, XStefanachi, ANicolotti, OIsabel Loza, MBrea, JEsteve, CSegarra, VVidal, BCarotti, A 1,3-dialkyl-8-N-substituted benzyloxycarbonylamino-9-deazaxanthines as potent adenosine receptor ligands: Design, synthesis, structure-affinity and structure-selectivity relationships. Bioorg Med Chem 17:3618-29 (2009)  
Target
Name:
Adenosine receptor A2b
Synonyms:
AA2BR_HUMAN ADORA2B Adenosine receptors A2b | Adenosine receptors; A2a & A2b
Type:
G Protein-Coupled Receptor (GPCR)
Mol. Mass.:
36341.22
Organism:
Homo sapiens (Human)
Description:
Residue:
332
  
Inhibitor
Name:
BDBM50258805
Synonyms:
CHEMBL466828 | [4-(2,3,4,5-Tetrahydro-2,4-dioxo-1,3-dipropyl-1H-pyrrolo[3,2-d]pyrimidin-6-yl)phenyl]methyl 4-(4-fluorophenyl)piperazine-1-carboxylate
Type:
Small organic molecule
Emp. Form.:
C30H34FN5O4
Mol. Mass.:
547.6205
SMILES:
CCCn1c2cc([nH]c2c(=O)n(CCC)c1=O)-c1ccc(COC(=O)N2CCN(CC2)c2ccc(F)cc2)cc1
: