Target
Adenosine receptor A2a
Ligand
BDBM50258709
Substrate
Meas. Tech.
ChEMBL_499867 (CHEMBL976199)
Ki
28.8±n/a nM
Citation
 Fernández, FCaamaño, OIsabel Nieto, MLópez, CGarcía-Mera, XStefanachi, ANicolotti, OIsabel Loza, MBrea, JEsteve, CSegarra, VVidal, BCarotti, A 1,3-dialkyl-8-N-substituted benzyloxycarbonylamino-9-deazaxanthines as potent adenosine receptor ligands: Design, synthesis, structure-affinity and structure-selectivity relationships. Bioorg Med Chem 17:3618-29 (2009)  
Target
Name:
Adenosine receptor A2a
Synonyms:
A2A adenosine receptor (hA2A) ADENOSINE A2 ADORA2 Adenosine A2A receptor (A2AAR)
Type:
G Protein-Coupled Receptor (GPCR)
Mol. Mass.:
44716.46
Organism:
Homo sapiens (Human)
Description:
P29274
Residue:
412
  
Inhibitor
Name:
BDBM50258709
Synonyms:
CHEMBL466021 | [4-(2,3,4,5-Tetrahydro-2,4-dioxo-1,3-dipropyl-1H-pyrrolo[3,2-d]pyrimidin-6-yl)phenyl]methyl phenylcarbamate
Type:
Small organic molecule
Emp. Form.:
C26H28N4O4
Mol. Mass.:
460.5249
SMILES:
CCCn1c2cc([nH]c2c(=O)n(CCC)c1=O)-c1ccc(COC(=O)Nc2ccccc2)cc1
: