Target
Alpha-2A adrenergic receptor
Ligand
BDBM50258517
Substrate
Meas. Tech.
ChEMBL_500050 (CHEMBL970453)
Ki
>4500±n/a nM
Citation
 Roberts, LRFish, PVIan Storer, RWhitlock, GA 6,7-Dihydro-5H-pyrrolo[1,2-a] imidazoles as potent and selective alpha1A adrenoceptor partial agonists. Bioorg Med Chem Lett 19:3113-7 (2009)  
Target
Name:
Alpha-2A adrenergic receptor
Synonyms:
ADA2A_HUMAN ADRA2R Adrenergic alpha2A Alpha-2 adrenergic receptor subtype C10 Alpha-2A adrenoreceptor alpha-2A adrenergic receptor [Homo sapiens]
Type:
Enzyme
Mol. Mass.:
48979.91
Organism:
Homo sapiens (Human)
Description:
P08913
Residue:
450
  
Inhibitor
Name:
BDBM50258517
Synonyms:
(S)-2-(6,7-dihydro-5H-pyrrolo[1,2-a]imidazol-6-yl)benzonitrile | CHEMBL466046
Type:
Small organic molecule
Emp. Form.:
C13H11N3
Mol. Mass.:
209.2465
SMILES:
N#Cc1ccccc1[C@@H]1Cc2nccn2C1
: