Target
Alpha-2A adrenergic receptor
Ligand
BDBM50258593
Substrate
Meas. Tech.
ChEMBL_500050 (CHEMBL970453)
Ki
>2370±n/a nM
Citation
 Roberts, LRFish, PVIan Storer, RWhitlock, GA 6,7-Dihydro-5H-pyrrolo[1,2-a] imidazoles as potent and selective alpha1A adrenoceptor partial agonists. Bioorg Med Chem Lett 19:3113-7 (2009)  
Target
Name:
Alpha-2A adrenergic receptor
Synonyms:
ADA2A_HUMAN ADRA2R Adrenergic alpha2A Alpha-2 adrenergic receptor subtype C10 Alpha-2A adrenoreceptor alpha-2A adrenergic receptor [Homo sapiens]
Type:
Enzyme
Mol. Mass.:
48979.91
Organism:
Homo sapiens (Human)
Description:
P08913
Residue:
450
  
Inhibitor
Name:
BDBM50258593
Synonyms:
6-(4-fluoro-2-(pyrimidin-5-yl)phenyl)-6,7-dihydro-5H-pyrrolo[1,2-a]imidazole | CHEMBL505414
Type:
Small organic molecule
Emp. Form.:
C16H13FN4
Mol. Mass.:
280.2996
SMILES:
Fc1ccc(C2Cc3nccn3C2)c(c1)-c1cncnc1
: