Target
5-hydroxytryptamine receptor 3A
Ligand
BDBM50258461
Substrate
Meas. Tech.
ChEMBL_523350 (CHEMBL1006686)
Ki
127±n/a nM
Citation
 Morelli, EGemma, SBudriesi, RCampiani, GNovellino, EFattorusso, CCatalanotti, BCoccone, SSRos, SBorrelli, GPersico, MFiorini, INacci, VIoan, PChiarini, AHamon, MCagnotto, AMennini, TFracasso, CColovic, MCaccia, SButini, S Specific targeting of peripheral serotonin 5-HT(3) receptors. Synthesis, biological investigation, and structure-activity relationships. J Med Chem 52:3548-62 (2009)  
Target
Name:
5-hydroxytryptamine receptor 3A
Synonyms:
5-HT3 5HT3A_RAT Htr3 Serotonin (5-HT) receptor | Zacopride site-R
Type:
Enzyme Catalytic Domain
Mol. Mass.:
55428.70
Organism:
RAT
Description:
5-HT3 HTR3A RAT::P35563
Residue:
483
  
Inhibitor
Name:
BDBM50258461
Synonyms:
5-[4-(7-Fluoropyrrolo[1,2-a]quinoxalin-4-yl)-piperazin-1-ylmethyl]-3H-[1,3,4]oxadiazol-2-one | CHEMBL466655
Type:
Small organic molecule
Emp. Form.:
C18H17FN6O2
Mol. Mass.:
368.365
SMILES:
Fc1ccc2c(c1)nc(N1CCN(Cc3n[nH]c(=O)o3)CC1)c1cccn21
: