Target
Androgen receptor
Ligand
BDBM18216
Substrate
Meas. Tech.
ChEMBL_523646 (CHEMBL998017)
Ki
7.1±n/a nM
Citation
 Mohler, MLBohl, CEJones, ACoss, CCNarayanan, RHe, YHwang, DJDalton, JTMiller, DD Nonsteroidal selective androgen receptor modulators (SARMs): dissociating the anabolic and androgenic activities of the androgen receptor for therapeutic benefit. J Med Chem 52:3597-617 (2009)  
Target
Name:
Androgen receptor
Synonyms:
ANDR_HUMAN Androgen Receptor Androgen receptor/Baculoviral IAP repeat-containing protein 2 Dihydrotestosterone receptor Nuclear receptor subfamily 3 group C member 4
Type:
Receptor
Mol. Mass.:
99185.27
Organism:
Homo sapiens (Human)
Description:
CHO cells were stably transfected with human AR gene.
Residue:
920
  
Inhibitor
Name:
BDBM18216
Synonyms:
(2R)-2-methyl-1-(2,2,2-trifluoroethyl)-9-(trifluoromethyl)-1H,2H,3H,6H,7H-quinolino[7,6-b][1,4]oxazin-7-one CHEMBL224263
Type:
Small organic molecule
Emp. Form.:
C15H12F6N2O2
Mol. Mass.:
366.2584
SMILES:
C[C@@H]1COc2cc3[nH]c(=O)cc(c3cc2N1CC(F)(F)F)C(F)(F)F
: