Target
Type-2 angiotensin II receptor
Ligand
BDBM50258825
Substrate
Meas. Tech.
ChEMBL_523390 (CHEMBL996322)
IC50
190±n/a nM
Citation
 Xu, LFarthing, AKDropinski, JFMeinke, PTMcCallum, CLeavitt, PSHickey, EJColwell, LBarrett, JLiu, K Nocathiacin analogs: Synthesis and antibacterial activity of novel water-soluble amides. Bioorg Med Chem Lett 19:3531-5 (2009)  
Target
Name:
Type-2 angiotensin II receptor
Synonyms:
AGTR2 AT2 Angiotensin II type 2 (AT-2) receptor Type-2 angiotensin II receptor
Type:
Enzyme Catalytic Domain
Mol. Mass.:
41201.61
Organism:
Homo sapiens (Human)
Description:
Angiotensin II, central 0 0::P50052
Residue:
363
  
Inhibitor
Name:
BDBM50258825
Synonyms:
CHEMBL510526
Type:
Small organic molecule
Emp. Form.:
C62H66N14O17S5
Mol. Mass.:
1439.596
SMILES:
CO\C(C)=C1\NC(=O)[C@@H](NC(=O)c2csc(n2)-c2cc(O)c(nc2-c2csc(n2)[C@@H]2COC(=O)c3c4CO[C@@H]([C@H](NC(=O)c5csc1n5)c1nc(cs1)C(=O)N2)[C@H](O[C@H]1C[C@](C)(O)[C@@H]([C@H](C)O1)N(C)C)C(=O)OCc1cccc(n3O)c41)-c1nc(cs1)C(=O)NCCN(C)C)[C@@H](C)O
: