Target
Gamma-aminobutyric acid receptor subunit alpha-5
Ligand
BDBM50000766
Substrate
Meas. Tech.
ChEMBL_519949 (CHEMBL954628)
Ki
9.8±n/a nM
Citation
 Taliani, SCosimelli, BDa Settimo, FMarini, AMLa Motta, CSimorini, FSalerno, SNovellino, EGreco, GCosconati, SMarinelli, LSalvetti, FL'Abbate, GTrasciatti, SMontali, MCosta, BMartini, C Identification of anxiolytic/nonsedative agents among indol-3-ylglyoxylamides acting as functionally selective agonists at the gamma-aminobutyric acid-A (GABAA) alpha2 benzodiazepine receptor. J Med Chem 52:3723-34 (2009)  
Target
Name:
Gamma-aminobutyric acid receptor subunit alpha-5
Synonyms:
GABA A Alpha5Beta2Gamma2 GABA A Alpha5m10Beta2Gamma2 GABA A Alpha5m9Beta2Gamma2 GABA A receptor alpha-5/beta-3/gamma-2 GBRA5_RAT Gabra5 | Gamma-aminobutyric acid receptor subunit alpha-5
Type:
Enzyme Catalytic Domain
Mol. Mass.:
52350.79
Organism:
RAT
Description:
GABA A alpha5 0 RAT::P19969
Residue:
464
  
Inhibitor
Name:
BDBM50000766
Synonyms:
CHEMBL12 US9271961, Diazepam
Type:
Small organic molecule
Emp. Form.:
C16H13ClN2O
Mol. Mass.:
284.74
SMILES:
CN1c2ccc(Cl)cc2C(=NCC1=O)c1ccccc1
: