Target
Type-1 angiotensin II receptor
Ligand
BDBM50009714
Substrate
Meas. Tech.
ChEBML_36160
IC50
420±n/a nM
Citation
 Murray, WVLalan, PGill, AAddo, MFLewis, JMLee, DKRampulla, RWachter, MPHsi, JDUnderwood, DC Substituted piperidin-2-one biphenyltetrazoles as angiotensin II antagonists Bioorg Med Chem Lett 2:1775-1779 (1992)    Article 
Target
Name:
Type-1 angiotensin II receptor
Synonyms:
AGTR1 Angiotensin II type 1a (AT-1a) receptor
Type:
PROTEIN
Mol. Mass.:
41107.81
Organism:
Bos taurus
Description:
ChEMBL_36779
Residue:
359
  
Inhibitor
Name:
BDBM50009714
Synonyms:
CHEMBL191 | {2-Butyl-5-chloro-3-[2'-(2H-tetrazol-5-yl)-biphenyl-4-ylmethyl]-4,5-dihydro-3H-imidazol-4-yl}-methanol(DuP 753)
Type:
Small organic molecule
Emp. Form.:
C22H25ClN6O
Mol. Mass.:
424.927
SMILES:
CCCCC1=NC(Cl)C(CO)N1Cc1ccc(cc1)-c1ccccc1-c1nnn[nH]1
: