Target
Type-1 angiotensin II receptor
Ligand
BDBM50280330
Substrate
Meas. Tech.
ChEBML_36160
IC50
320±n/a nM
Citation
 Murray, WVLalan, PGill, AAddo, MFLewis, JMLee, DKRampulla, RWachter, MPHsi, JDUnderwood, DC Substituted piperidin-2-one biphenyltetrazoles as angiotensin II antagonists Bioorg Med Chem Lett 2:1775-1779 (1992)    Article 
Target
Name:
Type-1 angiotensin II receptor
Synonyms:
AGTR1 Angiotensin II type 1a (AT-1a) receptor
Type:
PROTEIN
Mol. Mass.:
41107.81
Organism:
Bos taurus
Description:
ChEMBL_36779
Residue:
359
  
Inhibitor
Name:
BDBM50280330
Synonyms:
CHEMBL51001 | [4-Ethyl-4-methyl-6-oxo-1-[2'-(1H-tetrazol-5-yl)-biphenyl-4-ylmethyl]-piperidin-(2E)-ylidene]-acetic acid methyl ester
Type:
Small organic molecule
Emp. Form.:
C25H27N5O3
Mol. Mass.:
445.5136
SMILES:
CCC1(C)CC(=O)N(Cc2ccc(cc2)-c2ccccc2-c2nnn[nH]2)\C(C1)=C\C(=O)OC
: