Target
Sterol O-acyltransferase 1
Ligand
BDBM50051901
Substrate
Meas. Tech.
ChEMBL_48784 (CHEMBL661636)
IC50
69±n/a nM
Citation
 Ashton, MJBridge, AWBush, RCDron, DIHarris, NVJones, GDLythgoe, DJRiddell, DSmith, C RP 70676: A potent systematically available inhibitor of acyl-CoA:cholesterol O-acyl transferase (ACAT) Bioorg Med Chem Lett 2:375-380 (1992)    Article 
Target
Name:
Sterol O-acyltransferase 1
Synonyms:
ACACT ACAT Acetyl-CoA acetyltransferase, mitochondrial Acyl-CoA: cholesterol acyltransferase (ACAT) Cholesterol acyltransferase 1 SOAT1 STAT
Type:
Multi-pass membrane protein may form homo- or heterodimers.
Mol. Mass.:
64751.94
Organism:
Homo sapiens (Human)
Description:
P35610
Residue:
550
  
Inhibitor
Name:
BDBM50051901
Synonyms:
1-[5-(4,5-Diphenyl-1H-imidazol-2-ylsulfanyl)-pentyl]-3,5-dimethyl-1H-pyrazole | CHEMBL33780
Type:
Small organic molecule
Emp. Form.:
C25H28N4S
Mol. Mass.:
416.582
SMILES:
Cc1cc(C)n(CCCCCSc2nc(c([nH]2)-c2ccccc2)-c2ccccc2)n1
: