Target
Sterol O-acyltransferase 1
Ligand
BDBM50280422
Substrate
Meas. Tech.
ChEBML_48914
IC50
24±n/a nM
Citation
 Ashton, MJBridge, AWBush, RCDron, DIHarris, NVJones, GDLythgoe, DJRiddell, DSmith, C RP 70676: A potent systematically available inhibitor of acyl-CoA:cholesterol O-acyl transferase (ACAT) Bioorg Med Chem Lett 2:375-380 (1992)    Article 
Target
Name:
Sterol O-acyltransferase 1
Synonyms:
ACAT-1 Acat SOAT1_RAT Sterol O-acyltransferase, Soat
Type:
PROTEIN
Mol. Mass.:
64165.56
Organism:
Rattus norvegicus
Description:
ChEMBL_28796
Residue:
545
  
Inhibitor
Name:
BDBM50280422
Synonyms:
1-[5-(4,5-Diphenyl-1H-imidazol-2-ylsulfanyl)-pentyl]-1H-pyrazole | CHEMBL264816
Type:
Small organic molecule
Emp. Form.:
C23H24N4S
Mol. Mass.:
388.528
SMILES:
C(CCSc1nc(c([nH]1)-c1ccccc1)-c1ccccc1)CCn1cccn1
: